BDBM501640 US11028041, Compound 31
SMILES COC(=O)c1c(O)cc(O)c(Cl)c1CCc1cccnc1Cc1ccc(F)cc1
InChI Key InChIKey=LQNXPFCFTNNVLU-UHFFFAOYSA-N
Data  2 Kd
  Tab Delimited (TSV)   2D SDfile   Computed 3D by Vconf -m prep SDfile
Find this compound or compounds like it in BindingDB:
Activity Spreadsheet -- Enzyme Inhibition Constant Data from BindingDB
Found 1 hit for monomerid = 501640
TargetHeat shock protein HSP 90-alpha(Homo sapiens (Human))
University of Kansas
US Patent
LigandPNGBDBM501640(US11028041, Compound 31)
Affinity DataKd:  460nM. Assay description: The assay was performed in 96-well black, flat-bottom plates with a final volume of 100 μL. 25 μL of assay buffer (20 mM HEPES, pH 7.3, 50 ...
Ligand InfoPC cidPC sid
In DepthDetails US Patent